{"text_format":"1","workbook":"xlsx","n_sheets":4,"sheets":["MAIN","ABDICHTUNGSARBEITEN","SANITÄR","Datensatz"],"not_rendered":{"charts":0,"images":3,"macros":1,"external_links":0,"defined_names":2,"comments":0,"pivot_tables":0},"unopened":[],"bounds":{"document_bytes":16777216,"sheet_cells":100000,"rows_first":2000,"rows_last":500,"rows_between":2000,"halvings":0,"cell_chars":16384,"cell_head_chars":4096},"cells_cut":0,"cells_raw":0,"read":"whole","date_system":"1900"}

{"sheet":"MAIN","index":0,"n_rows":10,"n_cols":12,"rows_kept":10,"cut":false,"hidden":false,"merged":[[9,11,9,13],[8,11,8,13],[9,7,9,8],[8,7,8,8],[8,3,8,4],[9,3,9,4],[8,5,8,6],[9,5,9,6]]}
[]
[]
[]
[]
[]
[]
[]
[]
[null,null,"Baupreis- Index Auswahl nach Jahr","Quartal",null,"Gebäudeklasse",null,"Baupreis- Index in %",null,null,null,"Gesamte Positionen"]
[null,null,2020,"II",null,"Wohngebäude",null,{"$f":"Datensatz!C2","v":1.1803809523809523},null,null,null,{"$f":"SANITÄR!J254+ABDICHTUNGSARBEITEN!J99+0","v":234}]

{"sheet":"ABDICHTUNGSARBEITEN","index":1,"n_rows":99,"n_cols":10,"rows_kept":99,"cut":false,"hidden":false,"merged":[]}
[]
[]
[]
[]
[]
[null,null,"Suche:",null,null,null,null,null,"Treffer:"]
[null,null,null,null,null,null,null,null,{"$f":"COUNTIF($C$26:$C$257,\"*\"&$C$7&\"*\")","v":67}]
[]
["Katalog","Pos. Nr.","Ergebnis","Einheit","EP","INDEXPREIS","Von","Mittel","Bis"]
[{"$f":"IF($C$7=\"\",\"\",IFERROR(INDEX(A:A,_xlfn.AGGREGATE(15,6,ROW(Tabelle1[Bezeichnung])/(FIND($C$7,Tabelle1[Bezeichnung],1)>0),ROW()-9),1),\"\"))","v":""},{"$f":"IF($C$7=\"\",\"\",IFERROR(INDEX(B:B,_xlfn.AGGREGATE(15,6,ROW(Tabelle1[Bezeichnung])/(FIND($C$7,Tabelle1[Bezeichnung],1)>0),ROW()-9),1),\"\"))","v":""},{"$f":"IF($C$7=\"\",\"\",IFERROR(INDEX(C:C,_xlfn.AGGREGATE(15,6,ROW(Tabelle1[Bezeichnung])/(FIND($C$7,Tabelle1[Bezeichnung],1)>0),ROW()-9),1),\"\"))","v":""},{"$f":"IF($C$7=\"\",\"\",IFERROR(INDEX(D:D,_xlfn.AGGREGATE(15,6,ROW(Tabelle1[Bezeichnung])/(FIND($C$7,Tabelle1[Bezeichnung],1)>0),ROW()-9),1),\"\"))","v":""},{"$f":"IF($C$7=\"\",\"\",IFERROR(INDEX(E:E,_xlfn.AGGREGATE(15,6,ROW(Tabelle1[Bezeichnung])/(FIND($C$7,Tabelle1[Bezeichnung],1)>0),ROW()-9),1),\"\"))","v":""},{"$f":"IF($C$7=\"\",\"\",IFERROR(INDEX(F:F,_xlfn.AGGREGATE(15,6,ROW(Tabelle1[Bezeichnung])/(FIND($C$7,Tabelle1[Bezeichnung],1)>0),ROW()-9),1),\"\"))","v":""},{"$f":"IF($C$7=\"\",\"\",IFERROR(INDEX(G:G,_xlfn.AGGREGATE(15,6,ROW(Tabelle1[Bezeichnung])/(FIND($C$7,Tabelle1[Bezeichnung],1)>0),ROW()-9),1),\"\"))","v":""},{"$f":"IF($C$7=\"\",\"\",IFERROR(INDEX(H:H,_xlfn.AGGREGATE(15,6,ROW(Tabelle1[Bezeichnung])/(FIND($C$7,Tabelle1[Bezeichnung],1)>0),ROW()-9),1),\"\"))","v":""},{"$f":"IF($C$7=\"\",\"\",IFERROR(INDEX(I:I,_xlfn.AGGREGATE(15,6,ROW(Tabelle1[Bezeichnung])/(FIND($C$7,Tabelle1[Bezeichnung],1)>0),ROW()-9),1),\"\"))","v":""}]
[{"$f":"IF($C$7=\"\",\"\",IFERROR(INDEX(A:A,_xlfn.AGGREGATE(15,6,ROW(Tabelle1[Bezeichnung])/(FIND($C$7,Tabelle1[Bezeichnung],1)>0),ROW()-9),1),\"\"))","v":""},{"$f":"IF($C$7=\"\",\"\",IFERROR(INDEX(B:B,_xlfn.AGGREGATE(15,6,ROW(Tabelle1[Bezeichnung])/(FIND($C$7,Tabelle1[Bezeichnung],1)>0),ROW()-9),1),\"\"))","v":""},{"$f":"IF($C$7=\"\",\"\",IFERROR(INDEX(C:C,_xlfn.AGGREGATE(15,6,ROW(Tabelle1[Bezeichnung])/(FIND($C$7,Tabelle1[Bezeichnung],1)>0),ROW()-9),1),\"\"))","v":""},{"$f":"IF($C$7=\"\",\"\",IFERROR(INDEX(D:D,_xlfn.AGGREGATE(15,6,ROW(Tabelle1[Bezeichnung])/(FIND($C$7,Tabelle1[Bezeichnung],1)>0),ROW()-9),1),\"\"))","v":""},{"$f":"IF($C$7=\"\",\"\",IFERROR(INDEX(E:E,_xlfn.AGGREGATE(15,6,ROW(Tabelle1[Bezeichnung])/(FIND($C$7,Tabelle1[Bezeichnung],1)>0),ROW()-9),1),\"\"))","v":""},{"$f":"IF($C$7=\"\",\"\",IFERROR(INDEX(F:F,_xlfn.AGGREGATE(15,6,ROW(Tabelle1[Bezeichnung])/(FIND($C$7,Tabelle1[Bezeichnung],1)>0),ROW()-9),1),\"\"))","v":""},{"$f":"IF($C$7=\"\",\"\",IFERROR(INDEX(G:G,_xlfn.AGGREGATE(15,6,ROW(Tabelle1[Bezeichnung])/(FIND($C$7,Tabelle1[Bezeichnung],1)>0),ROW()-9),1),\"\"))","v":""},{"$f":"IF($C$7=\"\",\"\",IFERROR(INDEX(H:H,_xlfn.AGGREGATE(15,6,ROW(Tabelle1[Bezeichnung])/(FIND($C$7,Tabelle1[Bezeichnung],1)>0),ROW()-9),1),\"\"))","v":""},{"$f":"IF($C$7=\"\",\"\",IFERROR(INDEX(I:I,_xlfn.AGGREGATE(15,6,ROW(Tabelle1[Bezeichnung])/(FIND($C$7,Tabelle1[Bezeichnung],1)>0),ROW()-9),1),\"\"))","v":""}]
[{"$f":"IF($C$7=\"\",\"\",IFERROR(INDEX(A:A,_xlfn.AGGREGATE(15,6,ROW(Tabelle1[Bezeichnung])/(FIND($C$7,Tabelle1[Bezeichnung],1)>0),ROW()-9),1),\"\"))","v":""},{"$f":"IF($C$7=\"\",\"\",IFERROR(INDEX(B:B,_xlfn.AGGREGATE(15,6,ROW(Tabelle1[Bezeichnung])/(FIND($C$7,Tabelle1[Bezeichnung],1)>0),ROW()-9),1),\"\"))","v":""},{"$f":"IF($C$7=\"\",\"\",IFERROR(INDEX(C:C,_xlfn.AGGREGATE(15,6,ROW(Tabelle1[Bezeichnung])/(FIND($C$7,Tabelle1[Bezeichnung],1)>0),ROW()-9),1),\"\"))","v":""},{"$f":"IF($C$7=\"\",\"\",IFERROR(INDEX(D:D,_xlfn.AGGREGATE(15,6,ROW(Tabelle1[Bezeichnung])/(FIND($C$7,Tabelle1[Bezeichnung],1)>0),ROW()-9),1),\"\"))","v":""},{"$f":"IF($C$7=\"\",\"\",IFERROR(INDEX(E:E,_xlfn.AGGREGATE(15,6,ROW(Tabelle1[Bezeichnung])/(FIND($C$7,Tabelle1[Bezeichnung],1)>0),ROW()-9),1),\"\"))","v":""},{"$f":"IF($C$7=\"\",\"\",IFERROR(INDEX(F:F,_xlfn.AGGREGATE(15,6,ROW(Tabelle1[Bezeichnung])/(FIND($C$7,Tabelle1[Bezeichnung],1)>0),ROW()-9),1),\"\"))","v":""},{"$f":"IF($C$7=\"\",\"\",IFERROR(INDEX(G:G,_xlfn.AGGREGATE(15,6,ROW(Tabelle1[Bezeichnung])/(FIND($C$7,Tabelle1[Bezeichnung],1)>0),ROW()-9),1),\"\"))","v":""},{"$f":"IF($C$7=\"\",\"\",IFERROR(INDEX(H:H,_xlfn.AGGREGATE(15,6,ROW(Tabelle1[Bezeichnung])/(FIND($C$7,Tabelle1[Bezeichnung],1)>0),ROW()-9),1),\"\"))","v":""},{"$f":"IF($C$7=\"\",\"\",IFERROR(INDEX(I:I,_xlfn.AGGREGATE(15,6,ROW(Tabelle1[Bezeichnung])/(FIND($C$7,Tabelle1[Bezeichnung],1)>0),ROW()-9),1),\"\"))","v":""}]
[{"$f":"IF($C$7=\"\",\"\",IFERROR(INDEX(A:A,_xlfn.AGGREGATE(15,6,ROW(Tabelle1[Bezeichnung])/(FIND($C$7,Tabelle1[Bezeichnung],1)>0),ROW()-9),1),\"\"))","v":""},{"$f":"IF($C$7=\"\",\"\",IFERROR(INDEX(B:B,_xlfn.AGGREGATE(15,6,ROW(Tabelle1[Bezeichnung])/(FIND($C$7,Tabelle1[Bezeichnung],1)>0),ROW()-9),1),\"\"))","v":""},{"$f":"IF($C$7=\"\",\"\",IFERROR(INDEX(C:C,_xlfn.AGGREGATE(15,6,ROW(Tabelle1[Bezeichnung])/(FIND($C$7,Tabelle1[Bezeichnung],1)>0),ROW()-9),1),\"\"))","v":""},{"$f":"IF($C$7=\"\",\"\",IFERROR(INDEX(D:D,_xlfn.AGGREGATE(15,6,ROW(Tabelle1[Bezeichnung])/(FIND($C$7,Tabelle1[Bezeichnung],1)>0),ROW()-9),1),\"\"))","v":""},{"$f":"IF($C$7=\"\",\"\",IFERROR(INDEX(E:E,_xlfn.AGGREGATE(15,6,ROW(Tabelle1[Bezeichnung])/(FIND($C$7,Tabelle1[Bezeichnung],1)>0),ROW()-9),1),\"\"))","v":""},{"$f":"IF($C$7=\"\",\"\",IFERROR(INDEX(F:F,_xlfn.AGGREGATE(15,6,ROW(Tabelle1[Bezeichnung])/(FIND($C$7,Tabelle1[Bezeichnung],1)>0),ROW()-9),1),\"\"))","v":""},{"$f":"IF($C$7=\"\",\"\",IFERROR(INDEX(G:G,_xlfn.AGGREGATE(15,6,ROW(Tabelle1[Bezeichnung])/(FIND($C$7,Tabelle1[Bezeichnung],1)>0),ROW()-9),1),\"\"))","v":""},{"$f":"IF($C$7=\"\",\"\",IFERROR(INDEX(H:H,_xlfn.AGGREGATE(15,6,ROW(Tabelle1[Bezeichnung])/(FIND($C$7,Tabelle1[Bezeichnung],1)>0),ROW()-9),1),\"\"))","v":""},{"$f":"IF($C$7=\"\",\"\",IFERROR(INDEX(I:I,_xlfn.AGGREGATE(15,6,ROW(Tabelle1[Bezeichnung])/(FIND($C$7,Tabelle1[Bezeichnung],1)>0),ROW()-9),1),\"\"))","v":""}]
[{"$f":"IF($C$7=\"\",\"\",IFERROR(INDEX(A:A,_xlfn.AGGREGATE(15,6,ROW(Tabelle1[Bezeichnung])/(FIND($C$7,Tabelle1[Bezeichnung],1)>0),ROW()-9),1),\"\"))","v":""},{"$f":"IF($C$7=\"\",\"\",IFERROR(INDEX(B:B,_xlfn.AGGREGATE(15,6,ROW(Tabelle1[Bezeichnung])/(FIND($C$7,Tabelle1[Bezeichnung],1)>0),ROW()-9),1),\"\"))","v":""},{"$f":"IF($C$7=\"\",\"\",IFERROR(INDEX(C:C,_xlfn.AGGREGATE(15,6,ROW(Tabelle1[Bezeichnung])/(FIND($C$7,Tabelle1[Bezeichnung],1)>0),ROW()-9),1),\"\"))","v":""},{"$f":"IF($C$7=\"\",\"\",IFERROR(INDEX(D:D,_xlfn.AGGREGATE(15,6,ROW(Tabelle1[Bezeichnung])/(FIND($C$7,Tabelle1[Bezeichnung],1)>0),ROW()-9),1),\"\"))","v":""},{"$f":"IF($C$7=\"\",\"\",IFERROR(INDEX(E:E,_xlfn.AGGREGATE(15,6,ROW(Tabelle1[Bezeichnung])/(FIND($C$7,Tabelle1[Bezeichnung],1)>0),ROW()-9),1),\"\"))","v":""},{"$f":"IF($C$7=\"\",\"\",IFERROR(INDEX(F:F,_xlfn.AGGREGATE(15,6,ROW(Tabelle1[Bezeichnung])/(FIND($C$7,Tabelle1[Bezeichnung],1)>0),ROW()-9),1),\"\"))","v":""},{"$f":"IF($C$7=\"\",\"\",IFERROR(INDEX(G:G,_xlfn.AGGREGATE(15,6,ROW(Tabelle1[Bezeichnung])/(FIND($C$7,Tabelle1[Bezeichnung],1)>0),ROW()-9),1),\"\"))","v":""},{"$f":"IF($C$7=\"\",\"\",IFERROR(INDEX(H:H,_xlfn.AGGREGATE(15,6,ROW(Tabelle1[Bezeichnung])/(FIND($C$7,Tabelle1[Bezeichnung],1)>0),ROW()-9),1),\"\"))","v":""},{"$f":"IF($C$7=\"\",\"\",IFERROR(INDEX(I:I,_xlfn.AGGREGATE(15,6,ROW(Tabelle1[Bezeichnung])/(FIND($C$7,Tabelle1[Bezeichnung],1)>0),ROW()-9),1),\"\"))","v":""}]
[{"$f":"IF($C$7=\"\",\"\",IFERROR(INDEX(A:A,_xlfn.AGGREGATE(15,6,ROW(Tabelle1[Bezeichnung])/(FIND($C$7,Tabelle1[Bezeichnung],1)>0),ROW()-9),1),\"\"))","v":""},{"$f":"IF($C$7=\"\",\"\",IFERROR(INDEX(B:B,_xlfn.AGGREGATE(15,6,ROW(Tabelle1[Bezeichnung])/(FIND($C$7,Tabelle1[Bezeichnung],1)>0),ROW()-9),1),\"\"))","v":""},{"$f":"IF($C$7=\"\",\"\",IFERROR(INDEX(C:C,_xlfn.AGGREGATE(15,6,ROW(Tabelle1[Bezeichnung])/(FIND($C$7,Tabelle1[Bezeichnung],1)>0),ROW()-9),1),\"\"))","v":""},{"$f":"IF($C$7=\"\",\"\",IFERROR(INDEX(D:D,_xlfn.AGGREGATE(15,6,ROW(Tabelle1[Bezeichnung])/(FIND($C$7,Tabelle1[Bezeichnung],1)>0),ROW()-9),1),\"\"))","v":""},{"$f":"IF($C$7=\"\",\"\",IFERROR(INDEX(E:E,_xlfn.AGGREGATE(15,6,ROW(Tabelle1[Bezeichnung])/(FIND($C$7,Tabelle1[Bezeichnung],1)>0),ROW()-9),1),\"\"))","v":""},{"$f":"IF($C$7=\"\",\"\",IFERROR(INDEX(F:F,_xlfn.AGGREGATE(15,6,ROW(Tabelle1[Bezeichnung])/(FIND($C$7,Tabelle1[Bezeichnung],1)>0),ROW()-9),1),\"\"))","v":""},{"$f":"IF($C$7=\"\",\"\",IFERROR(INDEX(G:G,_xlfn.AGGREGATE(15,6,ROW(Tabelle1[Bezeichnung])/(FIND($C$7,Tabelle1[Bezeichnung],1)>0),ROW()-9),1),\"\"))","v":""},{"$f":"IF($C$7=\"\",\"\",IFERROR(INDEX(H:H,_xlfn.AGGREGATE(15,6,ROW(Tabelle1[Bezeichnung])/(FIND($C$7,Tabelle1[Bezeichnung],1)>0),ROW()-9),1),\"\"))","v":""},{"$f":"IF($C$7=\"\",\"\",IFERROR(INDEX(I:I,_xlfn.AGGREGATE(15,6,ROW(Tabelle1[Bezeichnung])/(FIND($C$7,Tabelle1[Bezeichnung],1)>0),ROW()-9),1),\"\"))","v":""}]
{"$rows_left_out":85}
{"sheet":"SANITÄR","index":2,"n_rows":254,"n_cols":10,"rows_kept":254,"cut":false,"hidden":false,"merged":[]}
[]
[]
[]
[]
[]
[null,null,"Suche:",null,null,null,null,null,"Treffer:"]
[null,null,null,null,null,null,null,null,{"$f":"COUNTIF($C$26:$C$253,\"*\"&$C$7&\"*\")","v":212}]
[]
["Katalog","Pos. Nr.","Ergebnis","Einheit","EP","INDEXPREIS","Von","Mittel","Bis"]
[{"$f":"IF($C$7=\"\",\"\",IFERROR(INDEX(A:A,_xlfn.AGGREGATE(15,6,ROW(Tabelle2[Bezeichnung])/(FIND($C$7,Tabelle2[Bezeichnung],1)>0),ROW()-9),1),\"\"))","v":""},{"$f":"IF($C$7=\"\",\"\",IFERROR(INDEX(B:B,_xlfn.AGGREGATE(15,6,ROW(Tabelle2[Bezeichnung])/(FIND($C$7,Tabelle2[Bezeichnung],1)>0),ROW()-9),1),\"\"))","v":""},{"$f":"IF($C$7=\"\",\"\",IFERROR(INDEX(C:C,_xlfn.AGGREGATE(15,6,ROW(Tabelle2[Bezeichnung])/(FIND($C$7,Tabelle2[Bezeichnung],1)>0),ROW()-9),1),\"\"))","v":""},{"$f":"IF($C$7=\"\",\"\",IFERROR(INDEX(D:D,_xlfn.AGGREGATE(15,6,ROW(Tabelle2[Bezeichnung])/(FIND($C$7,Tabelle2[Bezeichnung],1)>0),ROW()-9),1),\"\"))","v":""},{"$f":"IF($C$7=\"\",\"\",IFERROR(INDEX(E:E,_xlfn.AGGREGATE(15,6,ROW(Tabelle2[Bezeichnung])/(FIND($C$7,Tabelle2[Bezeichnung],1)>0),ROW()-9),1),\"\"))","v":""},{"$f":"IF($C$7=\"\",\"\",IFERROR(INDEX(F:F,_xlfn.AGGREGATE(15,6,ROW(Tabelle2[Bezeichnung])/(FIND($C$7,Tabelle2[Bezeichnung],1)>0),ROW()-9),1),\"\"))","v":""},{"$f":"IF($C$7=\"\",\"\",IFERROR(INDEX(G:G,_xlfn.AGGREGATE(15,6,ROW(Tabelle2[Bezeichnung])/(FIND($C$7,Tabelle2[Bezeichnung],1)>0),ROW()-9),1),\"\"))","v":""},{"$f":"IF($C$7=\"\",\"\",IFERROR(INDEX(H:H,_xlfn.AGGREGATE(15,6,ROW(Tabelle2[Bezeichnung])/(FIND($C$7,Tabelle2[Bezeichnung],1)>0),ROW()-9),1),\"\"))","v":""},{"$f":"IF($C$7=\"\",\"\",IFERROR(INDEX(I:I,_xlfn.AGGREGATE(15,6,ROW(Tabelle2[Bezeichnung])/(FIND($C$7,Tabelle2[Bezeichnung],1)>0),ROW()-9),1),\"\"))","v":""}]
[{"$f":"IF($C$7=\"\",\"\",IFERROR(INDEX(A:A,_xlfn.AGGREGATE(15,6,ROW(Tabelle2[Bezeichnung])/(FIND($C$7,Tabelle2[Bezeichnung],1)>0),ROW()-9),1),\"\"))","v":""},{"$f":"IF($C$7=\"\",\"\",IFERROR(INDEX(B:B,_xlfn.AGGREGATE(15,6,ROW(Tabelle2[Bezeichnung])/(FIND($C$7,Tabelle2[Bezeichnung],1)>0),ROW()-9),1),\"\"))","v":""},{"$f":"IF($C$7=\"\",\"\",IFERROR(INDEX(C:C,_xlfn.AGGREGATE(15,6,ROW(Tabelle2[Bezeichnung])/(FIND($C$7,Tabelle2[Bezeichnung],1)>0),ROW()-9),1),\"\"))","v":""},{"$f":"IF($C$7=\"\",\"\",IFERROR(INDEX(D:D,_xlfn.AGGREGATE(15,6,ROW(Tabelle2[Bezeichnung])/(FIND($C$7,Tabelle2[Bezeichnung],1)>0),ROW()-9),1),\"\"))","v":""},{"$f":"IF($C$7=\"\",\"\",IFERROR(INDEX(E:E,_xlfn.AGGREGATE(15,6,ROW(Tabelle2[Bezeichnung])/(FIND($C$7,Tabelle2[Bezeichnung],1)>0),ROW()-9),1),\"\"))","v":""},{"$f":"IF($C$7=\"\",\"\",IFERROR(INDEX(F:F,_xlfn.AGGREGATE(15,6,ROW(Tabelle2[Bezeichnung])/(FIND($C$7,Tabelle2[Bezeichnung],1)>0),ROW()-9),1),\"\"))","v":""},{"$f":"IF($C$7=\"\",\"\",IFERROR(INDEX(G:G,_xlfn.AGGREGATE(15,6,ROW(Tabelle2[Bezeichnung])/(FIND($C$7,Tabelle2[Bezeichnung],1)>0),ROW()-9),1),\"\"))","v":""},{"$f":"IF($C$7=\"\",\"\",IFERROR(INDEX(H:H,_xlfn.AGGREGATE(15,6,ROW(Tabelle2[Bezeichnung])/(FIND($C$7,Tabelle2[Bezeichnung],1)>0),ROW()-9),1),\"\"))","v":""},{"$f":"IF($C$7=\"\",\"\",IFERROR(INDEX(I:I,_xlfn.AGGREGATE(15,6,ROW(Tabelle2[Bezeichnung])/(FIND($C$7,Tabelle2[Bezeichnung],1)>0),ROW()-9),1),\"\"))","v":""}]
[{"$f":"IF($C$7=\"\",\"\",IFERROR(INDEX(A:A,_xlfn.AGGREGATE(15,6,ROW(Tabelle2[Bezeichnung])/(FIND($C$7,Tabelle2[Bezeichnung],1)>0),ROW()-9),1),\"\"))","v":""},{"$f":"IF($C$7=\"\",\"\",IFERROR(INDEX(B:B,_xlfn.AGGREGATE(15,6,ROW(Tabelle2[Bezeichnung])/(FIND($C$7,Tabelle2[Bezeichnung],1)>0),ROW()-9),1),\"\"))","v":""},{"$f":"IF($C$7=\"\",\"\",IFERROR(INDEX(C:C,_xlfn.AGGREGATE(15,6,ROW(Tabelle2[Bezeichnung])/(FIND($C$7,Tabelle2[Bezeichnung],1)>0),ROW()-9),1),\"\"))","v":""},{"$f":"IF($C$7=\"\",\"\",IFERROR(INDEX(D:D,_xlfn.AGGREGATE(15,6,ROW(Tabelle2[Bezeichnung])/(FIND($C$7,Tabelle2[Bezeichnung],1)>0),ROW()-9),1),\"\"))","v":""},{"$f":"IF($C$7=\"\",\"\",IFERROR(INDEX(E:E,_xlfn.AGGREGATE(15,6,ROW(Tabelle2[Bezeichnung])/(FIND($C$7,Tabelle2[Bezeichnung],1)>0),ROW()-9),1),\"\"))","v":""},{"$f":"IF($C$7=\"\",\"\",IFERROR(INDEX(F:F,_xlfn.AGGREGATE(15,6,ROW(Tabelle2[Bezeichnung])/(FIND($C$7,Tabelle2[Bezeichnung],1)>0),ROW()-9),1),\"\"))","v":""},{"$f":"IF($C$7=\"\",\"\",IFERROR(INDEX(G:G,_xlfn.AGGREGATE(15,6,ROW(Tabelle2[Bezeichnung])/(FIND($C$7,Tabelle2[Bezeichnung],1)>0),ROW()-9),1),\"\"))","v":""},{"$f":"IF($C$7=\"\",\"\",IFERROR(INDEX(H:H,_xlfn.AGGREGATE(15,6,ROW(Tabelle2[Bezeichnung])/(FIND($C$7,Tabelle2[Bezeichnung],1)>0),ROW()-9),1),\"\"))","v":""},{"$f":"IF($C$7=\"\",\"\",IFERROR(INDEX(I:I,_xlfn.AGGREGATE(15,6,ROW(Tabelle2[Bezeichnung])/(FIND($C$7,Tabelle2[Bezeichnung],1)>0),ROW()-9),1),\"\"))","v":""}]
[{"$f":"IF($C$7=\"\",\"\",IFERROR(INDEX(A:A,_xlfn.AGGREGATE(15,6,ROW(Tabelle2[Bezeichnung])/(FIND($C$7,Tabelle2[Bezeichnung],1)>0),ROW()-9),1),\"\"))","v":""},{"$f":"IF($C$7=\"\",\"\",IFERROR(INDEX(B:B,_xlfn.AGGREGATE(15,6,ROW(Tabelle2[Bezeichnung])/(FIND($C$7,Tabelle2[Bezeichnung],1)>0),ROW()-9),1),\"\"))","v":""},{"$f":"IF($C$7=\"\",\"\",IFERROR(INDEX(C:C,_xlfn.AGGREGATE(15,6,ROW(Tabelle2[Bezeichnung])/(FIND($C$7,Tabelle2[Bezeichnung],1)>0),ROW()-9),1),\"\"))","v":""},{"$f":"IF($C$7=\"\",\"\",IFERROR(INDEX(D:D,_xlfn.AGGREGATE(15,6,ROW(Tabelle2[Bezeichnung])/(FIND($C$7,Tabelle2[Bezeichnung],1)>0),ROW()-9),1),\"\"))","v":""},{"$f":"IF($C$7=\"\",\"\",IFERROR(INDEX(E:E,_xlfn.AGGREGATE(15,6,ROW(Tabelle2[Bezeichnung])/(FIND($C$7,Tabelle2[Bezeichnung],1)>0),ROW()-9),1),\"\"))","v":""},{"$f":"IF($C$7=\"\",\"\",IFERROR(INDEX(F:F,_xlfn.AGGREGATE(15,6,ROW(Tabelle2[Bezeichnung])/(FIND($C$7,Tabelle2[Bezeichnung],1)>0),ROW()-9),1),\"\"))","v":""},{"$f":"IF($C$7=\"\",\"\",IFERROR(INDEX(G:G,_xlfn.AGGREGATE(15,6,ROW(Tabelle2[Bezeichnung])/(FIND($C$7,Tabelle2[Bezeichnung],1)>0),ROW()-9),1),\"\"))","v":""},{"$f":"IF($C$7=\"\",\"\",IFERROR(INDEX(H:H,_xlfn.AGGREGATE(15,6,ROW(Tabelle2[Bezeichnung])/(FIND($C$7,Tabelle2[Bezeichnung],1)>0),ROW()-9),1),\"\"))","v":""},{"$f":"IF($C$7=\"\",\"\",IFERROR(INDEX(I:I,_xlfn.AGGREGATE(15,6,ROW(Tabelle2[Bezeichnung])/(FIND($C$7,Tabelle2[Bezeichnung],1)>0),ROW()-9),1),\"\"))","v":""}]
[{"$f":"IF($C$7=\"\",\"\",IFERROR(INDEX(A:A,_xlfn.AGGREGATE(15,6,ROW(Tabelle2[Bezeichnung])/(FIND($C$7,Tabelle2[Bezeichnung],1)>0),ROW()-9),1),\"\"))","v":""},{"$f":"IF($C$7=\"\",\"\",IFERROR(INDEX(B:B,_xlfn.AGGREGATE(15,6,ROW(Tabelle2[Bezeichnung])/(FIND($C$7,Tabelle2[Bezeichnung],1)>0),ROW()-9),1),\"\"))","v":""},{"$f":"IF($C$7=\"\",\"\",IFERROR(INDEX(C:C,_xlfn.AGGREGATE(15,6,ROW(Tabelle2[Bezeichnung])/(FIND($C$7,Tabelle2[Bezeichnung],1)>0),ROW()-9),1),\"\"))","v":""},{"$f":"IF($C$7=\"\",\"\",IFERROR(INDEX(D:D,_xlfn.AGGREGATE(15,6,ROW(Tabelle2[Bezeichnung])/(FIND($C$7,Tabelle2[Bezeichnung],1)>0),ROW()-9),1),\"\"))","v":""},{"$f":"IF($C$7=\"\",\"\",IFERROR(INDEX(E:E,_xlfn.AGGREGATE(15,6,ROW(Tabelle2[Bezeichnung])/(FIND($C$7,Tabelle2[Bezeichnung],1)>0),ROW()-9),1),\"\"))","v":""},{"$f":"IF($C$7=\"\",\"\",IFERROR(INDEX(F:F,_xlfn.AGGREGATE(15,6,ROW(Tabelle2[Bezeichnung])/(FIND($C$7,Tabelle2[Bezeichnung],1)>0),ROW()-9),1),\"\"))","v":""},{"$f":"IF($C$7=\"\",\"\",IFERROR(INDEX(G:G,_xlfn.AGGREGATE(15,6,ROW(Tabelle2[Bezeichnung])/(FIND($C$7,Tabelle2[Bezeichnung],1)>0),ROW()-9),1),\"\"))","v":""},{"$f":"IF($C$7=\"\",\"\",IFERROR(INDEX(H:H,_xlfn.AGGREGATE(15,6,ROW(Tabelle2[Bezeichnung])/(FIND($C$7,Tabelle2[Bezeichnung],1)>0),ROW()-9),1),\"\"))","v":""},{"$f":"IF($C$7=\"\",\"\",IFERROR(INDEX(I:I,_xlfn.AGGREGATE(15,6,ROW(Tabelle2[Bezeichnung])/(FIND($C$7,Tabelle2[Bezeichnung],1)>0),ROW()-9),1),\"\"))","v":""}]
[{"$f":"IF($C$7=\"\",\"\",IFERROR(INDEX(A:A,_xlfn.AGGREGATE(15,6,ROW(Tabelle2[Bezeichnung])/(FIND($C$7,Tabelle2[Bezeichnung],1)>0),ROW()-9),1),\"\"))","v":""},{"$f":"IF($C$7=\"\",\"\",IFERROR(INDEX(B:B,_xlfn.AGGREGATE(15,6,ROW(Tabelle2[Bezeichnung])/(FIND($C$7,Tabelle2[Bezeichnung],1)>0),ROW()-9),1),\"\"))","v":""},{"$f":"IF($C$7=\"\",\"\",IFERROR(INDEX(C:C,_xlfn.AGGREGATE(15,6,ROW(Tabelle2[Bezeichnung])/(FIND($C$7,Tabelle2[Bezeichnung],1)>0),ROW()-9),1),\"\"))","v":""},{"$f":"IF($C$7=\"\",\"\",IFERROR(INDEX(D:D,_xlfn.AGGREGATE(15,6,ROW(Tabelle2[Bezeichnung])/(FIND($C$7,Tabelle2[Bezeichnung],1)>0),ROW()-9),1),\"\"))","v":""},{"$f":"IF($C$7=\"\",\"\",IFERROR(INDEX(E:E,_xlfn.AGGREGATE(15,6,ROW(Tabelle2[Bezeichnung])/(FIND($C$7,Tabelle2[Bezeichnung],1)>0),ROW()-9),1),\"\"))","v":""},{"$f":"IF($C$7=\"\",\"\",IFERROR(INDEX(F:F,_xlfn.AGGREGATE(15,6,ROW(Tabelle2[Bezeichnung])/(FIND($C$7,Tabelle2[Bezeichnung],1)>0),ROW()-9),1),\"\"))","v":""},{"$f":"IF($C$7=\"\",\"\",IFERROR(INDEX(G:G,_xlfn.AGGREGATE(15,6,ROW(Tabelle2[Bezeichnung])/(FIND($C$7,Tabelle2[Bezeichnung],1)>0),ROW()-9),1),\"\"))","v":""},{"$f":"IF($C$7=\"\",\"\",IFERROR(INDEX(H:H,_xlfn.AGGREGATE(15,6,ROW(Tabelle2[Bezeichnung])/(FIND($C$7,Tabelle2[Bezeichnung],1)>0),ROW()-9),1),\"\"))","v":""},{"$f":"IF($C$7=\"\",\"\",IFERROR(INDEX(I:I,_xlfn.AGGREGATE(15,6,ROW(Tabelle2[Bezeichnung])/(FIND($C$7,Tabelle2[Bezeichnung],1)>0),ROW()-9),1),\"\"))","v":""}]
{"$rows_left_out":240}
{"sheet":"Datensatz","index":3,"n_rows":71,"n_cols":9,"rows_kept":71,"cut":false,"hidden":false,"merged":[[1,6,1,8]]}
[]
[null,"Ergebnis",{"$f":"INDEX(1:1048576,C8,B8)","v":1.1803809523809523},null,null,"Quelle, Prüflink:","DESTATITS LINK"]
[null,null,null,null,null,"ø Steigerung in %:",{"$f":"(G28-G8)/21","v":8.3809523809523778E-3},{"$f":"(H28-H8)/21","v":8.6190476190476165E-3},{"$f":"(I28-I8)/21","v":8.6666666666666697E-3}]
["Liste","Trefferspalte","Trefferzeile","Suchindex","Jahr","Quartal","Wohngebäude","Bürogebäude","Industriegebäude"]
[]
[]
[]
[2015,{"$f":"MATCH(MAIN!F10,Datensatz!4:4,0)","v":7},{"$f":"MATCH(MAIN!C10&MAIN!D10,Datensatz!D:D,0)","v":29},{"$f":"Tabelle3[[#This Row],[Jahr]]&Tabelle3[[#This Row],[Quartal]]","v":"2015I"},2015,"I",0.996,0.995,0.995]
[2016,null,null,{"$f":"E8&Tabelle3[[#This Row],[Quartal]]","v":"2015II"},null,"II",0.998,0.998,0.998]
[2017,null,null,{"$f":"E8&Tabelle3[[#This Row],[Quartal]]","v":"2015III"},null,"III",1.002,1.002,0.10299999999999999]
[2018,null,null,{"$f":"E8&Tabelle3[[#This Row],[Quartal]]","v":"2015IV"},null,"IV",1.004,1.0049999999999999,1.004]
[2019,null,null,{"$f":"Tabelle3[[#This Row],[Jahr]]&Tabelle3[[#This Row],[Quartal]]","v":"2016I"},2016,"I",1.012,1.0129999999999999,1.012]
[2020,null,null,{"$f":"E12&Tabelle3[[#This Row],[Quartal]]","v":"2016II"},null,"II",1.0189999999999999,1.02,1.018]
[2021,null,null,{"$f":"E12&Tabelle3[[#This Row],[Quartal]]","v":"2016III"},null,"III",1.024,1.0249999999999999,1.024]
[2022,null,null,{"$f":"E12&Tabelle3[[#This Row],[Quartal]]","v":"2016IV"},null,"IV",1.0269999999999999,1.0289999999999999,1.028]
{"$rows_left_out":56}